{"text_format":"1","workbook":"xlsx","n_sheets":10,"sheets":["Lists","Rev. history","Instructions","Justification","Rating","Questionnaire","Non Conformities","Aux","Comments","Supplement"],"not_rendered":{"charts":1,"images":3,"macros":1,"external_links":0,"defined_names":48,"comments":5,"pivot_tables":0},"unopened":[],"bounds":{"document_bytes":16777216,"sheet_cells":100000,"rows_first":2000,"rows_last":500,"rows_between":2000,"halvings":0,"cell_chars":16384,"cell_head_chars":4096},"cells_cut":0,"cells_raw":0,"read":"whole","date_system":"1900"}

{"sheet":"Lists","index":0,"n_rows":243,"n_cols":21,"rows_kept":243,"cut":false,"hidden":true,"merged":[]}
["Product Division","IDCO","Commodity","Country","Supplier Facility Type ","Supplier Type","Assessment Reason","Certifications",null,"Regions","PL","Cables & Components","Mechanics","Electricals & Power","Electronics & PCBA","Systems & system components","Utility systems (DC/MV)",{"$f":"Justification!$E$22","v":0},null,"Comments "]
["Direct Materials","Stack","Electronics","Afghanistan","Manufacturing","New Potential  supplier","SMA - Onboarding","ISO 9001",null,"Europe, Middle East & Africa","Residential","Cables & cable harnesses","Cabinets","Stacks & power modules","Active electronic components","Systems & system components","Transformers",{"$f":"IF($R$1=0,\"\",HLOOKUP(Justification!$E$22,$L$1:$Q$27,ROW(),0))","v":""},{"$f":"COUNTIF(R2:R27,\"<>0\")","v":26},1," "]
["OEM","Power Modules","Electricals & Power","Albania","Distribution","Current Supplier","SMA - TSM","ISO 14001",null,"Americas","Commercial","Connection parts","Aluminum die casting","Inductors","Passive electronic components","Wireless communication","Medium voltage turnkey systems",{"$f":"IF($R$1=0,\"\",HLOOKUP(Justification!$E$22,$L$1:$Q$27,ROW(),0))","v":""},null,2,"In order for assessment to be considered valid, justification of rating is to be included in observations field."]
[null,"Inductors Utility","Cables & Components","Algeria","Broker/Agent/Sales office",null,"Supplier - Self-assessment","ISO 45001",null,"Asia Pacific","Utility","Small parts mechanical","Sheet metal parts","Switches & contactors","Current transformers","Data management systemes","Accessories & customized parts for MVS",{"$f":"IF($R$1=0,\"\",HLOOKUP(Justification!$E$22,$L$1:$Q$27,ROW(),0))","v":""},null,3,"In order for assessment to be considered valid, justification of rating is to be included in observations field."]
[null,"Power Supplies","Mechanics","American Samoa",null,null,null,"ISO 50001",null,null,null,"Packaging","Busbars","Fuses","Ferrites","Inverter","Medium voltage switchgears",{"$f":"IF($R$1=0,\"\",HLOOKUP(Justification!$E$22,$L$1:$Q$27,ROW(),0))","v":""},null,4,"In order for assessment to be considered valid, justification of rating is to be included in comments field."]
[null,"Inductors Residential, Commercial","PCB & Systems","Andorra",null,null,null,"IATF 16949",null,null,null,"Documentation & labeling","Heat sinks","Power supplies","Electromechanical components (on PCB)","Charging systems & components","DC-Combiner",{"$f":"IF($R$1=0,\"\",HLOOKUP(Justification!$E$22,$L$1:$Q$27,ROW(),0))","v":""},null,5," "]
[null,"Fans ","Utility","Angola",null,null,null,"ISO / TS 22163",null,null,null,"Plastic components","Deep drawn parts","Fans & climate components","Printed circuit boards (PCB)",null,null,{"$f":"IF($R$1=0,\"\",HLOOKUP(Justification!$E$22,$L$1:$Q$27,ROW(),0))","v":""}]
[null,"Climate Components",null,"Anguilla",null,null,null,"AS/EN 9100",null,null,null,null,"Laser welding metal parts","Displays","Printed circuit board assemblies (PCBA)",null,null,{"$f":"IF($R$1=0,\"\",HLOOKUP(Justification!$E$22,$L$1:$Q$27,ROW(),0))","v":""}]
[null,"Switches",null,"Antarctica",null,null,null,null,null,null,null,null,null,"Customized batteries & storage",null,null,null,{"$f":"IF($R$1=0,\"\",HLOOKUP(Justification!$E$22,$L$1:$Q$27,ROW(),0))","v":""}]
[null,"Contactors",null,"Antigua and Barbuda",null,null,null,null,null,null,null,null,null,"Capacitors (ex PCB)",null,null,null,{"$f":"IF($R$1=0,\"\",HLOOKUP(Justification!$E$22,$L$1:$Q$27,ROW(),0))","v":""}]
[null,"Fuses",null,"Argentina",null,null,null,null,null,null,null,null,null,"Measure components",null,null,null,{"$f":"IF($R$1=0,\"\",HLOOKUP(Justification!$E$22,$L$1:$Q$27,ROW(),0))","v":""}]
[null,"Aluminum die casting",null,"Armenia",null,null,null,null,null,null,null,null,null,"Shunts (ex PCB)",null,null,null,{"$f":"IF($R$1=0,\"\",HLOOKUP(Justification!$E$22,$L$1:$Q$27,ROW(),0))","v":""}]
[null,"Busbars",null,"Aruba",null,null,null,null,null,null,null,null,null,"Connectors (ex PCB)",null,null,null,{"$f":"IF($R$1=0,\"\",HLOOKUP(Justification!$E$22,$L$1:$Q$27,ROW(),0))","v":""}]
[null,"Cabinets",null,"Australia",null,null,null,null,null,null,null,null,null,null,null,null,null,{"$f":"IF($R$1=0,\"\",HLOOKUP(Justification!$E$22,$L$1:$Q$27,ROW(),0))","v":""}]
[null,"Sheet metal",null,"Austria",null,null,null,null,null,null,null,null,null,null,null,null,null,{"$f":"IF($R$1=0,\"\",HLOOKUP(Justification!$E$22,$L$1:$Q$27,ROW(),0))","v":""}]
{"$rows_left_out":229}
{"sheet":"Rev. history","index":1,"n_rows":9,"n_cols":9,"rows_kept":9,"cut":false,"hidden":true,"merged":[]}
["1","Revision","Date of implementation","Introduced by","Description of change",null,{"$f":"MAX(A:A)","v":9},"Current rev",{"$f":"VLOOKUP(G1,A:B,2,FALSE)","v":"070518"}]
[{"$f":"A1+1","v":2},160416,"2016-04-16","M.Grzesiak","Sheet protection against unauthorized changes enabled"]
[3,180416,"2016-04-18","M.Grzesiak","Exclamation box added to the questionnaire sheet as a remainder to provide comments"]
[{"$f":"A3+1","v":4},260416,"2016-04-26","M.Grzesiak","Observation/Comments remainder added to the questionnaire\nResult will not be generated if comments are missing\nExclamation box deleted"]
[5,300816,"2016-08-30","M.Grzesiak","Rating sheet was hid. Hide/Unhide buttons added. Formatting of NA cells changed. NC and comments list generation corrected"]
[6,"241016","2016-10-24","M.Grzesiak","Distributors/Sales office scope limiter added.\nSustainability questions added\nSection status added"]
[7,271016,"2016-10-27","M.Grzesiak","Supplier id + dtae added to actionlist"]
[8,"010318","2018-03-01","M.Grzesiak","Questions 3.0d,m; 4.0d; 9.0f,j deleted\nA number of questions revised\nJustification sheet changed (certifications, commodity)"]
[9,"070518","2018-05-07","L.Knapik","Release"]

{"sheet":"Instructions","index":2,"n_rows":25,"n_cols":10,"rows_kept":25,"cut":false,"hidden":false,"merged":[[20,9,20,12],[20,6,20,8],[20,3,20,5],[19,9,19,12],[19,3,19,5],[13,2,13,3],[17,1,17,15],[10,5,10,7],[11,5,11,7],[12,5,12,7],[9,8,9,10],[10,8,10,10],[11,8,11,10],[12,8,12,10],[0,1,0,16],[2,1,2,16],[5,1,5,15],[7,1,7,15],[9,5,9,7],[9,2,9,3],[10,2,10,3],[11,2,11,3],[12,2,12,3],[24,3,24,5],[24,6,24,8],[24,9,24,12],[15,1,15,15],[13,8,13,10],[13,5,13,7],[22,9,22,12],[21,9,21,12],[21,6,22,8],[21,3,22,5],[19,6,19,8],[23,6,23,8],[23,9,23,12],[23,3,23,5],[21,2,22,2],[21,1,22,1]]}
[]
[null,"> PURPOSE"]
[null,"The purpose of the Vendor Quality Evaluation (VQE) Questionnaire is to establish levels of competence and suitability of potential suppliers to SMA."]
[]
[null,"> USE"]
[null,"The questionnaire contains a list of questions, which shall be evaluated by the supplier through marking an appropriate score in the respective checkbox. \nIf a particular Question is not applicable to the organization - the \"N/A\" shall be marked and an extensive justification needs to be provided in the in the \"Assesor comments\" field, why the question is not applicable. The \"Assesor comments\" fields shall be extensively used to link supplier answer to its internal system or procedure. All comments/observations must be submitted in English.  It is essential that all supporting documents are attached by the Supplier in course of completing the VQE self-assessment. All of the questions need to be addressed to gain an overal rating result - othervise assessment is considered invalid."]
[]
[null,"Process Audit - Question Answering and Scoring:"]
[]
[null,null,"Question response",null,"Score","Rationale",null,null,"CAR"]
[null,null,"NO",null,0,"Required, but not included in Management System.",null,null,"Yes - Non Conformances need to be addressed"]
[null,null,"YES BUT",null,1,"In the Management System but execution requires improvement",null,null,"Non Conformances need to be addressed unless otherwise indicated by SMA"]
[null,null,"YES",null,2,"In the Management System with implementation well executed",null,null,"No"]
[null,null,"NA",null,"-","Not applicable for this item",null,null,"-"]
[]
{"$rows_left_out":11}
{"sheet":"Justification","index":3,"n_rows":58,"n_cols":27,"rows_kept":58,"cut":false,"hidden":false,"merged":[[51,5,51,10],[27,5,27,10],[29,5,29,10],[33,5,33,10],[42,6,42,8],[42,10,42,12],[44,6,44,8],[46,6,46,8],[44,10,44,12],[46,10,46,12],[37,5,37,10],[0,2,0,18],[4,17,4,18],[6,17,6,18],[53,5,53,10],[55,5,55,10],[23,4,23,9],[21,4,21,9],[35,17,35,18],[31,17,31,18],[37,17,37,18],[31,5,31,10],[35,5,35,10],[39,5,39,10],[50,14,50,18],[33,17,33,18],[29,17,29,18],[1,2,1,18],[2,4,2,18],[11,17,11,18],[13,17,13,18],[15,17,15,18],[9,5,9,10],[11,5,11,10]]}
["This is secret code"]
[null,null,"Vendor Quality Evaluation - VQE"]
[null,null,"revision:","2023-11-23"]
[]
[{"$f":"IF(B5=\">\",1,0)","v":0},null,"General Information:",null,null,null,null,null,null,null,null,null,null,null,null,"Supplier Name:"]
[]
[{"$f":"IF(B7=\">\",1,0)","v":0},null,null,null,null,null,null,null,null,null,null,null,null,null,null,"Self assesment/ Audit Date:"]
[0]
[0]
[0,null,"Assessment No."]
[0]
[0,null,"Assessment Responsible:",null,null,null,null,null,null,null,null,null,null,null,null,"Auditors:"]
[]
[]
[0]
{"$rows_left_out":44}
{"sheet":"Rating","index":4,"n_rows":47,"n_cols":18,"rows_kept":47,"cut":false,"hidden":true,"merged":[[32,2,32,4],[13,6,13,12],[16,3,16,4],[7,10,7,12],[9,10,9,12],[11,10,11,12],[15,3,15,4],[18,3,18,4],[13,2,14,4],[4,6,4,12],[32,5,32,12],[44,9,44,12],[46,9,46,12],[4,2,4,3],[7,2,7,3],[19,3,19,4],[22,3,22,4],[20,3,20,4],[31,2,31,4],[23,3,23,4],[21,3,21,4],[26,6,26,8],[26,10,26,12],[28,3,28,4],[31,5,31,12]]}
[]
[{"$f":"SUM(A3:A99)","v":{"$error":"#REF!"}},null,"Vendor Quality Evaluation - VQE"]
[null,null,"revision:",{"$f":"Justification!D3","v":"2023-11-23"}]
[null,null,"Company name:",null,null,null,"Commodity:"]
[{"$f":"IF(#REF!=\">\",1,0)","v":{"$error":"#REF!"}},null,{"$f":"IF(Justification!$R$5=\"\",\"\",Justification!$R$5)","v":""},null,null,null,{"$f":"IF(Justification!$E$24=\"\",\"\",Justification!$E$24)","v":""}]
[{"$f":"IF(#REF!=\">\",1,0)","v":{"$error":"#REF!"}}]
[{"$f":"IF(#REF!=\">\",1,0)","v":{"$error":"#REF!"}},null,"Purpose of Assessment:",null,null,null,null,null,null,null,"Auditors:"]
[{"$f":"IF(#REF!=\">\",1,0)","v":{"$error":"#REF!"}},null,{"$f":"IF(Justification!$F$56=\"\",\"\",Justification!$F$56)","v":""},null,null,null,null,null,null,null,{"$f":"IF(Justification!$R12=\"\",\"\",Justification!$R12)","v":""}]
[]
[{"$f":"IF(#REF!=\">\",1,0)","v":{"$error":"#REF!"}},null,null,null,null,null,null,null,null,null,{"$f":"IF(Justification!$R14=\"\",\"\",Justification!$R14)","v":""}]
[]
[{"$f":"IF(#REF!=\">\",1,0)","v":{"$error":"#REF!"}},null,null,null,null,null,null,null,null,null,{"$f":"IF(Justification!$R16=\"\",\"\",Justification!$R16)","v":""}]
[{"$f":"IF(#REF!=\">\",1,0)","v":{"$error":"#REF!"}}]
[{"$f":"IF(#REF!=\">\",1,0)","v":{"$error":"#REF!"}},null,"Assessment area",null,null,null,"SCORES"]
[{"$f":"IF(#REF!=\">\",1,0)","v":{"$error":"#REF!"}},null,null,null,null,null,"Max",null,"Applicable",null,"Actual",null,"%",0.8,null,"Not scored","Unacceptable","Acceptable"]
{"$rows_left_out":33}
{"sheet":"Questionnaire","index":5,"n_rows":227,"n_cols":21,"rows_kept":227,"cut":false,"hidden":false,"merged":[[223,3,223,6],[207,2,208,2],[207,3,207,6],[222,3,222,6],[52,3,52,6],[189,2,190,2],[189,3,189,6],[95,3,95,6],[80,2,81,2],[52,2,53,2],[198,3,198,6],[199,3,199,6],[180,3,180,6],[181,3,181,6],[172,3,172,6],[150,2,151,2],[1,0,1,8],[33,2,34,2],[33,3,33,6],[5,3,5,7],[21,3,21,6],[22,3,22,6],[7,2,8,2],[7,3,7,6],[4,3,4,6],[9,1,20,1],[31,3,31,7],[159,3,159,6],[160,3,160,6],[150,3,150,6],[130,3,130,6],[137,3,137,6],[138,3,138,6],[147,3,147,7],[94,3,94,6],[50,3,50,7],[78,3,78,7],[104,3,104,7],[128,3,128,7],[41,3,41,6],[42,3,42,6],[80,3,80,6],[68,3,68,6],[69,3,69,6],[106,2,107,2],[118,3,118,6],[119,3,119,6],[106,3,106,6],[130,2,131,2],[210,1,221,1],[191,1,197,1],[132,1,136,1],[152,1,158,1],[35,1,40,1],[54,1,67,1],[82,1,93,1],[109,1,117,1],[170,3,170,7],[187,3,187,7],[205,3,205,7],[209,3,209,7],[174,1,179,1],[172,2,173,2]]}
[]
[]
[null,null,null,null,null,null,null,null,null,null,null,null,2,0,0,0,1,0,{"$f":"CONCATENATE(M3,N3,O3,P3,Q3,R3)","v":"200010"}]
[null,null,null,null,null,null,null,null,null,null,null,null,2,0,0,0,1,1,{"$f":"CONCATENATE(M4,N4,O4,P4,Q4,R4)","v":"200011"},null,"2 points no comment needed"]
[null,null,null,null,null,null,null,null,{"$f":"IF(Justification!$R$5=\"\",\"\",Justification!$R$5)","v":""},null,null,null,0,1,0,0,0,1,{"$f":"CONCATENATE(M5,N5,O5,P5,Q5,R5)","v":"010001"},null,"1 p observation needed"]
[null,null,"SECT. 1","STRATEGY AND PLANNING",null,null,null,null,null,null,null,null,0,0,1,0,0,1,"001001",null,"0 p observation needed"]
[null,null,null,null,null,null,null,null,null,null,null,null,0,0,0,1,1,0,"000110",null,"NA comment needed"]
[null,null,"QUESTION","SCORE",null,null,null,"ASSESSOR OBSERVATIONS","ASSESSOR COMMENTS",null,null,null,2,1,0,"NA","O","C","Combination","suitable?"]
[null,null,null,2,1,0,"NA","0;1",2]
["1.0a",{"$f":"IF(H22>0,\"Section incomplete – Please rate all the questions\",IF(SUM(T10:T21)>100,\"Section incomplete - Missing comments\",\"Section complete\"))","v":"Section incomplete – Please rate all the questions"},"Is organization capable to commit to contractual quality agreement (CAQ) (e.g. signed CAQ with current cusotmers) ? ","o","o","o","o",null,null,null,{"$f":"IF(COUNTIF(D10:G10,\"n\")<1,\"Please assess this question\",IF(AND(COUNTIF(E10:F10,\"n\")>0,H10=\"\"),\"Please place an observation\",IF(AND(G10=\"n\",I10=\"\"),\"Please place a comment\",IF(AND(OR(D10=\"n\",G10=\"n\"),H10<>\"\"),\"Please delete the observation\",IF(AND(OR(E10=\"n\",F10=\"n\"),I10<>\"\"),\"Please delete the comment\",\"\")))))","v":"Please assess this question"},{"$f":"IF(OR(F10=\"n\",E10=\"n\"),\"CAR\",IF(AND(D10=\"n\",I10<>\"\"),\"CO\",\"\"))","v":""},{"$f":"IF(D10=\"n\",2,0)","v":0},{"$f":"IF(E10=\"n\",1,0)","v":0},{"$f":"IF(F10=\"n\",1,0)","v":0},{"$f":"IF(G10=\"n\",1,0)","v":0},{"$f":"IF(H10=\"\",1,0)","v":1},{"$f":"IF(I10=\"\",1,0)","v":1},{"$f":"CONCATENATE(M10,N10,O10,P10,Q10,R10)","v":"000011"},{"$f":"_xlfn.IFNA(MATCH(S10,$S$3:$S$7,0),1000)","v":1000}]
["1.0b",null,"Have commited objectives been analyzed and action taken where the targets are not being achieved?","o","o","o","o",null,null,null,{"$f":"IF(COUNTIF(D11:G11,\"n\")<1,\"Please assess this question\",IF(AND(COUNTIF(E11:F11,\"n\")>0,H11=\"\"),\"Please place an observation\",IF(AND(G11=\"n\",I11=\"\"),\"Please place a comment\",IF(AND(OR(D11=\"n\",G11=\"n\"),H11<>\"\"),\"Please delete the observation\",IF(AND(OR(E11=\"n\",F11=\"n\"),I11<>\"\"),\"Please delete the comment\",\"\")))))","v":"Please assess this question"},{"$f":"IF(OR(F11=\"n\",E11=\"n\"),\"CAR\",IF(AND(D11=\"n\",I11<>\"\"),\"CO\",\"\"))","v":""},{"$f":"IF(D11=\"n\",2,0)","v":0},{"$f":"IF(E11=\"n\",1,0)","v":0},{"$f":"IF(F11=\"n\",1,0)","v":0},{"$f":"IF(G11=\"n\",1,0)","v":0},{"$f":"IF(H11=\"\",1,0)","v":1},{"$f":"IF(I11=\"\",1,0)","v":1},"000011",{"$f":"_xlfn.IFNA(MATCH(S11,$S$3:$S$7,0),1000)","v":1000}]
["1.0c",null,"Is there a system (including improvement actions) to establish quality metrics that monitor internal failures, external failures, prevention, and appraisal?","o","o","o","o",null,null,null,"Please assess this question","",0,0,0,0,1,1,"000011",1000]
["1.0d",null,"Have specific improvement projects been identified and measured appropriately in 1.0c?","o","o","o","o",null,null,null,"Please assess this question","",0,0,0,0,1,1,"000011",1000]
["1.0e",null,"Is documented process (including reponsibilities) for New Part Development/Introduction established and adhered to?","o","o","o","o",null,null,null,"Please assess this question","",0,0,0,0,1,1,"000011",1000]
["1.0f",null,"Is there a process to submit first production samples (PPAP) with fully compliant documentation as requested by customer (e.g. specific level of PPAP (acc. AIAG))? ","o","o","o","o",null,null,null,"Please assess this question","",0,0,0,0,1,1,"000011",1000]
{"$rows_left_out":213}
{"sheet":"Non Conformities","index":6,"n_rows":29,"n_cols":18,"rows_kept":29,"cut":false,"hidden":false,"merged":[[6,1,6,8],[4,1,4,13],[6,10,6,14]]}
[]
[null,null,null,"Supplier Name:",null,null,null,null,{"$f":"IF(Justification!$R$5=\"\",\"\",Justification!$R$5)","v":""}]
[]
[null,null,null,"Self assesment/ Audit Date:",null,null,null,null,{"$f":"IF(Justification!$R$7=\"\",\"\",Justification!$R$7)","v":""}]
[]
[null,null,null,null,"Supplier Issues","Supplier Issues","Supplier Issues","Supplier Issues"]
[null,"to be completed by auditor",null,null,null,null,null,null,null,null,"to be completed by the organization (mandatory)"]
[null,"Section/\nPos.",null,"Description",null,null,null,null,"Weakness / Findings","Assessment matrix","Corrective Action \n(against identified issue)","Person responsible (name / company)","Planned Start Date","Planned Finish Date","Comments / Notes ","% completion","Actual Finish Date","Closure verification date by SMA"]
[null,"1.0b",null,"Have the trends in meeting the above objectives been analyzed and action taken where the targets are not being achieved?"]
[null,"1.0d",null,"Have specific improvement projects been identified and measured appropriately in 1.0c?"]
[null,"1.0e",null,"Is responsbility for New Part Development Introduction clearly assigned to a specific position? Is this position organizationally capable to lead the program efficiently e.g. manager, leader)?"]
[null,"1.0f",null,"Is there a process to submit first production samples (PPAP) with fully compliant documentation as requested by customer (e.g. specific level of PPAP (acc. AIAG))? "]
[null,"1.0i",null,"How does the organization manage communications with sub-suppliers for changes that may adversely affect customer's products and vice-versa?"]
[null,"2.0b",null,"Is there an effective system for approval / validation of parts and where necessary, processes prior to commencement of production at the supplier’s facility?"]
[null,"2.0c",null,"Is there an effective system for ongoing monitoring of supplier performance and a means of communicating performance back to the supplier?"]
{"$rows_left_out":15}
{"sheet":"Aux","index":7,"n_rows":127,"n_cols":14,"rows_kept":127,"cut":false,"hidden":true,"merged":[[37,0,37,7],[0,2,0,11]]}
[null,null,"SECTIONS"]
[null,null,1,2,3,4,5,6,7,8,9,10]
[null,null,{"$f":"Questionnaire!#REF!","v":{"$error":"#REF!"}},{"$f":"Questionnaire!#REF!","v":{"$error":"#REF!"}},{"$f":"Questionnaire!#REF!","v":{"$error":"#REF!"}},{"$f":"Questionnaire!#REF!","v":{"$error":"#REF!"}},{"$f":"Questionnaire!#REF!","v":{"$error":"#REF!"}},{"$f":"Questionnaire!#REF!","v":{"$error":"#REF!"}},{"$f":"Questionnaire!#REF!","v":{"$error":"#REF!"}},{"$f":"Questionnaire!#REF!","v":{"$error":"#REF!"}},{"$f":"Questionnaire!#REF!","v":{"$error":"#REF!"}},{"$f":"Questionnaire!#REF!","v":{"$error":"#REF!"}}]
[null,null,{"$f":"Questionnaire!#REF!","v":{"$error":"#REF!"}},{"$f":"Questionnaire!#REF!","v":{"$error":"#REF!"}},{"$f":"Questionnaire!#REF!","v":{"$error":"#REF!"}},{"$f":"Questionnaire!#REF!","v":{"$error":"#REF!"}},{"$f":"Questionnaire!#REF!","v":{"$error":"#REF!"}},{"$f":"Questionnaire!#REF!","v":{"$error":"#REF!"}},{"$f":"Questionnaire!#REF!","v":{"$error":"#REF!"}},{"$f":"Questionnaire!#REF!","v":{"$error":"#REF!"}},{"$f":"Questionnaire!#REF!","v":{"$error":"#REF!"}},{"$f":"Questionnaire!#REF!","v":{"$error":"#REF!"}}]
[null,null,{"$f":"Questionnaire!#REF!","v":{"$error":"#REF!"}},{"$f":"Questionnaire!#REF!","v":{"$error":"#REF!"}},{"$f":"Questionnaire!#REF!","v":{"$error":"#REF!"}},{"$f":"Questionnaire!#REF!","v":{"$error":"#REF!"}},{"$f":"Questionnaire!#REF!","v":{"$error":"#REF!"}},{"$f":"Questionnaire!#REF!","v":{"$error":"#REF!"}},{"$f":"Questionnaire!#REF!","v":{"$error":"#REF!"}},{"$f":"Questionnaire!#REF!","v":{"$error":"#REF!"}},{"$f":"Questionnaire!#REF!","v":{"$error":"#REF!"}},{"$f":"Questionnaire!#REF!","v":{"$error":"#REF!"}}]
[null,null,{"$f":"Questionnaire!#REF!","v":{"$error":"#REF!"}},{"$f":"Questionnaire!#REF!","v":{"$error":"#REF!"}},{"$f":"Questionnaire!#REF!","v":{"$error":"#REF!"}},{"$f":"Questionnaire!#REF!","v":{"$error":"#REF!"}},{"$f":"Questionnaire!#REF!","v":{"$error":"#REF!"}},{"$f":"Questionnaire!#REF!","v":{"$error":"#REF!"}},{"$f":"Questionnaire!#REF!","v":{"$error":"#REF!"}},{"$f":"Questionnaire!#REF!","v":{"$error":"#REF!"}},{"$f":"Questionnaire!#REF!","v":{"$error":"#REF!"}},{"$f":"Questionnaire!#REF!","v":{"$error":"#REF!"}}]
[null,null,{"$f":"Questionnaire!#REF!","v":{"$error":"#REF!"}},{"$f":"Questionnaire!#REF!","v":{"$error":"#REF!"}},{"$f":"Questionnaire!#REF!","v":{"$error":"#REF!"}},{"$f":"Questionnaire!#REF!","v":{"$error":"#REF!"}},{"$f":"Questionnaire!#REF!","v":{"$error":"#REF!"}},{"$f":"Questionnaire!#REF!","v":{"$error":"#REF!"}},{"$f":"Questionnaire!#REF!","v":{"$error":"#REF!"}},{"$f":"Questionnaire!#REF!","v":{"$error":"#REF!"}},{"$f":"Questionnaire!#REF!","v":{"$error":"#REF!"}},{"$f":"Questionnaire!#REF!","v":{"$error":"#REF!"}}]
[null,null,{"$f":"Questionnaire!#REF!","v":{"$error":"#REF!"}},{"$f":"Questionnaire!#REF!","v":{"$error":"#REF!"}},{"$f":"Questionnaire!#REF!","v":{"$error":"#REF!"}},{"$f":"Questionnaire!#REF!","v":{"$error":"#REF!"}},{"$f":"Questionnaire!#REF!","v":{"$error":"#REF!"}},null,{"$f":"Questionnaire!#REF!","v":{"$error":"#REF!"}},{"$f":"Questionnaire!#REF!","v":{"$error":"#REF!"}},{"$f":"Questionnaire!#REF!","v":{"$error":"#REF!"}},{"$f":"Questionnaire!#REF!","v":{"$error":"#REF!"}}]
[null,null,{"$f":"Questionnaire!#REF!","v":{"$error":"#REF!"}},null,{"$f":"Questionnaire!#REF!","v":{"$error":"#REF!"}},{"$f":"Questionnaire!#REF!","v":{"$error":"#REF!"}},{"$f":"Questionnaire!#REF!","v":{"$error":"#REF!"}},null,{"$f":"Questionnaire!#REF!","v":{"$error":"#REF!"}},null,{"$f":"Questionnaire!#REF!","v":{"$error":"#REF!"}},{"$f":"Questionnaire!#REF!","v":{"$error":"#REF!"}}]
[null,null,{"$f":"Questionnaire!#REF!","v":{"$error":"#REF!"}},null,{"$f":"Questionnaire!#REF!","v":{"$error":"#REF!"}},{"$f":"Questionnaire!#REF!","v":{"$error":"#REF!"}},null,null,null,null,{"$f":"Questionnaire!#REF!","v":{"$error":"#REF!"}},{"$f":"Questionnaire!#REF!","v":{"$error":"#REF!"}}]
[null,null,{"$f":"Questionnaire!#REF!","v":{"$error":"#REF!"}},null,{"$f":"Questionnaire!#REF!","v":{"$error":"#REF!"}},{"$f":"Questionnaire!#REF!","v":{"$error":"#REF!"}},null,null,null,null,null,{"$f":"Questionnaire!#REF!","v":{"$error":"#REF!"}}]
[null,null,{"$f":"Questionnaire!#REF!","v":{"$error":"#REF!"}},null,{"$f":"Questionnaire!#REF!","v":{"$error":"#REF!"}},{"$f":"Questionnaire!#REF!","v":{"$error":"#REF!"}},null,null,null,null,null,{"$f":"Questionnaire!#REF!","v":{"$error":"#REF!"}}]
[null,null,{"$f":"Questionnaire!#REF!","v":{"$error":"#REF!"}},null,{"$f":"Questionnaire!#REF!","v":{"$error":"#REF!"}},{"$f":"Questionnaire!#REF!","v":{"$error":"#REF!"}},null,null,null,null,null,{"$f":"Questionnaire!#REF!","v":{"$error":"#REF!"}}]
[null,null,{"$f":"Questionnaire!#REF!","v":{"$error":"#REF!"}},null,{"$f":"Questionnaire!#REF!","v":{"$error":"#REF!"}},{"$f":"Questionnaire!#REF!","v":{"$error":"#REF!"}},null,null,null,null,null,{"$f":"Questionnaire!#REF!","v":{"$error":"#REF!"}}]
[null,null,null,null,{"$f":"Questionnaire!#REF!","v":{"$error":"#REF!"}}]
{"$rows_left_out":113}
{"sheet":"Comments","index":8,"n_rows":8,"n_cols":17,"rows_kept":8,"cut":false,"hidden":true,"merged":[[6,1,6,8],[4,0,4,12],[6,9,6,13]]}
[]
[null,null,null,"Supplier Name:",null,null,null,null,{"$f":"IF(Justification!$R$5=\"\",\"\",Justification!$R$5)","v":""}]
[null,null,null,"Self assesment/ Audit Date:",null,null,null,null,{"$f":"IF(Justification!$R$7=\"\",\"\",Justification!$R$7)","v":""}]
[]
[]
[null,null,null,null,"Electrolux Issues","Electrolux Issues","Electrolux Issues","Electrolux Issues"]
[null,"to be completed by auditor",null,null,null,null,null,null,null,"to be completed by the organization (optional)"]
[null,"Section/Pos.",null,"Description","Assessment Matrix",null,null,null,"Observations","Corrective Action \n(against identified issue)","Person responsible (name / company)","Planned Start Date","Planned Finish Date","Comments / Notes ","% completion","Actual Finish Date","Closure verification date by SMA"]

{"sheet":"Supplement","index":9,"n_rows":9,"n_cols":11,"rows_kept":9,"cut":false,"hidden":true,"merged":[[1,1,1,6],[6,1,6,6],[4,1,4,6],[7,1,7,2],[7,3,7,7]]}
[]
[]
[null,null,"Supplier Name:",{"$f":"IF(Justification!$R$5=\"\",\"\",Justification!$R$5)","v":""}]
[null,null,"Self assesment/ Audit Date:",{"$f":"IF(Justification!$R$7=\"\",\"\",Justification!$R$7)","v":""}]
[]
[]
[null,"Any additional supplier quality system requirements as regards eventual intrinsic specific points (…ex. Quality problems): to be verified onsite"]
[null,"to be completed by auditor",null,"to be completed by the organization"]
[null,"Points arisen","Assessor Notes/Comments","Corrective Action \n(against identified issue)","Person responsible (name / company)","Planned Start Date","Planned Finish Date","Comments / Notes ","% completion","Actual Finish Date","Closure verification date by SMA"]